AXI-Lite & AXI-Stream is a core topic in AMBA Family (APB / AHB / AXI). AXI-Lite removes bursts for control paths while AXI-Stream moves ordered data without addresses. Senior engineers treat it as a contract problem: each boundary must preserve transaction identity, ordering rules, and forward progress under backpressure.
AXI-Lite removes bursts for control paths while AXI-Stream moves ordered data without addresses.
Primary metric: register response latency, stream bubble rate, packet boundary errors
Primary artifact: TVALID/TREADY trace, TLAST packet log, control register access test
Owners: IP owner, verification owner, driver owner
Layer model: software intent → transaction → channel/link → physical/timing
Debug posture: find the first deviation, not the loudest timeout
In silicon integration, AXI-Lite & AXI-Stream failures appear as hung transactions, corrupted data, bandwidth cliffs, or bring-up stalls. AMBA separates control (Lite/APB) from data movement (AXI) and streaming (AXIS). Without mechanism-first analysis, teams burn weeks widening buses or blaming firmware.
AXI-STREAM PACKET
clk _|‾|_|‾|_|‾|_|‾|_|‾|_|‾|_
tvalid _|‾‾‾‾‾‾‾‾‾‾‾‾‾‾‾‾‾|_____
tready _|‾‾‾‾‾|__|‾‾‾‾‾‾‾‾‾|_____ (consumer backpressure mid-packet)
tdata B0 B1 -- B2 B3
tlast ________________|‾|_____ (marks end of packet)
Bubble: when tready=0, the same beat is held; data must not change.Name the workload or traffic class exercising AXI-Lite & AXI-Stream.
Open register response latency, stream bubble rate, packet boundary errors and identify the failing cluster (p99 often matters more than average).
Tag transaction identity: ID, address, endpoint, lane, or cache line.
Map the symptom to protocol layer: transaction, link, or physical.
Collect TVALID/TREADY trace, TLAST packet log, control register access test and align timestamp with VIP or analyzer view.
Reduce to smallest legal/illegal sequence that reproduces the bug.
Propose one bounded fix and list compliance + product regressions.
Handshake activity implies the transaction is legal.
Peak interface width equals useful payload bandwidth.
A VIP pass guarantees integrated-system correctness.
Software timeouts always mean the PHY or link is broken.
More buffering fixes ordering or coherence bugs without analysis.
AXI-STREAM PACKET
clk _|‾|_|‾|_|‾|_|‾|_|‾|_|‾|_
tvalid _|‾‾‾‾‾‾‾‾‾‾‾‾‾‾‾‾‾|_____
tready _|‾‾‾‾‾|__|‾‾‾‾‾‾‾‾‾|_____ (consumer backpressure mid-packet)
tdata B0 B1 -- B2 B3
tlast ________________|‾|_____ (marks end of packet)
Bubble: when tready=0, the same beat is held; data must not change.AXI-LITE vs AXI-FULL
AXI-Lite : single beat, no burst, no ID reorder -> control/registers
AXI-Full : bursts, IDs, reorder, outstanding -> data movement
Use Lite for a register block; do not pay for burst logic you never use.LAYER RESPONSIBILITY — AXI-Lite & AXI-Stream
layer owns common failure
----------- -------------------------- -----------------------
software intent, ordering needs wrong assumption
transaction id/addr/len/attributes ordering / outstanding
link/channel handshake, credits, retry backpressure / deadlock
physical clock/reset/lanes/PHY timing / training / SI
observability waveform/log/counter missing evidenceAMBA is the on-chip lingua franca: APB for control, AHB for legacy bursts, AXI for high-performance coherent fabrics.
AMBA INTEGRATION MAP
CPU --AXI--> NIC --AXI--> SRAM
| |
+--AXI-Lite--> peripherals (GPIO, timers)
+--AXI-Stream-> video pipe
Every bridge is a contract rewrite: width, ID, burst, cache attrs.AXI CHANNEL ACTIVITY (mixed traffic)
AW+W ████████████
AR ████████████████
R ██████████████
B ████████
Read-heavy phase: AR/R dominate; write resp may look idle while system is healthy.AR/AW/R/B channel utilization
write resp latency
read OSTD depth
SLVERR/DECERR count
bridge hang log
Write burst hung because W beats arrived before AW for a narrow bridge that reordered channels. VIP flagged nothing until full-system traffic interleaved reads and writes.
Hung write: verify AW/W ordering and wlast alignment.
Hung read: check arready stall and rlast per ID.
Decode errors: address map vs interconnect route table.
Ask: what is the first transaction that deviates, and which spec rule does it test?
Connect every protocol claim to a transaction identity and measurable metric.
Store the artifact (waveform, log, counter) next to every signoff decision.
Debugging timeouts without finding the first bad transaction.
Quoting peak bus width without payload efficiency and retry overhead.
Treating VIP compliance as a substitute for system integration replay.
AMBA separates control (Lite/APB) from data movement (AXI) and streaming (AXIS).
This content block can't be displayed here.
Block type: unknown
This content block can't be displayed here.
Block type: unknown